[monero-project/monero] in Monero-wallet-cli ERROR!! (#3848)

hi, when I build then:

[ 58%] Building CXX object tests/fuzz/CMakeFiles/load-from-binary_fuzz_tests.dir/load_from_binary.cpp.o
Scanning dependencies of target load-from-json_fuzz_tests
make[3]: Leaving directory ‘/home/rpmbuild/gits/monero/build/release’
make[3]: Entering directory ‘/home/rpmbuild/gits/monero/build/release’
[ 59%] Building CXX object tests/fuzz/CMakeFiles/load-from-json_fuzz_tests.dir/load_from_json.cpp.o
[ 59%] Building CXX object tests/fuzz/CMakeFiles/load-from-binary_fuzz_tests.dir/fuzzer.cpp.o
[ 59%] Building CXX object tests/fuzz/CMakeFiles/load-from-json_fuzz_tests.dir/fuzzer.cpp.o
[ 59%] Linking CXX executable load-from-binary_fuzz_tests
cc1plus: all warnings being treated as errors
make[3]: *** [src/wallet/CMakeFiles/obj_wallet.dir/build.make:63: src/wallet/CMakeFiles/obj_wallet.dir/wallet2.cpp.o] Error 1
make[3]: Leaving directory ‘/home/rpmbuild/gits/monero/build/release’
make[2]: *** [CMakeFiles/Makefile2:2227: src/wallet/CMakeFiles/obj_wallet.dir/all] Error 2
make[2]: *** Waiting for unfinished jobs….
make[3]: Leaving directory ‘/home/rpmbuild/gits/monero/build/release’
[ 59%] Built target load-from-binary_fuzz_tests
[ 59%] Linking CXX executable load-from-json_fuzz_tests
make[3]: Leaving directory ‘/home/rpmbuild/gits/monero/build/release’
[ 59%] Built target load-from-json_fuzz_tests
make[2]: Leaving directory ‘/home/rpmbuild/gits/monero/build/release’
make[1]: *** [Makefile:141: all] Error 2
make[1]: Leaving directory ‘/home/rpmbuild/gits/monero/build/release’
make: *** [Makefile:73: release-all] Error 2

Добавить комментарий