[EOSIO/eos] >>>>>>>>>>>>>>>>>>>> CMAKE building EOSIO has exited with the above error. (#3651)

./eosio_build.sh

Beginning build version: 1.2
Thu May 31 08:12:48 UTC 2018
User: cybrosys
git head id: d9df25ac1ad50ad4fd4880e70841863db31d9172
Current branch: master

ARCHITECTURE: Linux

OS name: Ubuntu
OS Version: 16.04
CPU speed: 2534.338Mhz
CPU cores: 2
Physical Memory: 7856 Mgb
Disk install: /dev/sda1
Disk space total: 142G
Disk space available: 64G

Checking for installed dependencies.

Package clang-4.0 found.
Package lldb-4.0 found.
Package libclang-4.0-dev found.
Package cmake found.
Package make found.
Package automake found.
Package libbz2-dev found.
Package libssl-dev found.
Package libgmp3-dev found.
Package autotools-dev found.
Package build-essential found.
Package libicu-dev found.
Package python2.7-dev found.
Package python3-dev found.
Package autoconf found.
Package libtool found.
Package curl found.
Package zlib1g-dev found.
Package doxygen found.
Package graphviz found.

No required dpkg dependencies to install.

Checking boost library installation.
Boost 1.67.0 found at /home/cybrosys/opt/boost_1_67_0.

Checking MongoDB installation.
MongoDB configuration found at /home/cybrosys/opt/mongodb/mongod.conf.

Checking MongoDB C++ driver installation.
Mongo C++ driver found at /usr/local/lib/libmongocxx-static.a.

Checking secp256k1-zkp installation.
secp256k1 found @ /usr/local/lib.

Checking for LLVM with WASM support.
WASM found at /home/cybrosys/opt/wasm/bin.

>>>>>>>> ALL dependencies sucessfully found or installed . Installing EOSIO

>>>>>>>> CMAKE_BUILD_TYPE=Release
>>>>>>>> ENABLE_COVERAGE_TESTING=false
>>>>>>>> DOXYGEN=false

— The CXX compiler identification is Clang 4.0.0
— Check for working CXX compiler: /usr/bin/clang++-4.0
— Check for working CXX compiler: /usr/bin/clang++-4.0 — broken
CMake Error at /usr/share/cmake-3.5/Modules/CMakeTestCXXCompiler.cmake:54 (message):
The C++ compiler «/usr/bin/clang++-4.0″ is not able to compile a simple
test program.

It fails with the following output:

Change Dir: /home/cybrosys/project/eos/eos/build/CMakeFiles/CMakeTmp

Run Build Command:»/usr/bin/make» «cmTC_a0a89/fast»

/usr/bin/make -f CMakeFiles/cmTC_a0a89.dir/build.make
CMakeFiles/cmTC_a0a89.dir/build

make[1]: Entering directory
‘/home/cybrosys/project/eos/eos/build/CMakeFiles/CMakeTmp’

Building CXX object CMakeFiles/cmTC_a0a89.dir/testCXXCompiler.cxx.o

/usr/bin/clang++-4.0 -o CMakeFiles/cmTC_a0a89.dir/testCXXCompiler.cxx.o -c
/home/cybrosys/project/eos/eos/build/CMakeFiles/CMakeTmp/testCXXCompiler.cxx

Linking CXX executable cmTC_a0a89

/usr/bin/cmake -E cmake_link_script CMakeFiles/cmTC_a0a89.dir/link.txt
—verbose=1

/usr/bin/clang++-4.0 CMakeFiles/cmTC_a0a89.dir/testCXXCompiler.cxx.o -o
cmTC_a0a89

/usr/bin/ld: cannot find -lstdc++

clang: error: linker command failed with exit code 1 (use -v to see
invocation)

CMakeFiles/cmTC_a0a89.dir/build.make:97: recipe for target ‘cmTC_a0a89’
failed

make[1]: *** [cmTC_a0a89] Error 1

make[1]: Leaving directory
‘/home/cybrosys/project/eos/eos/build/CMakeFiles/CMakeTmp’

Makefile:126: recipe for target ‘cmTC_a0a89/fast’ failed

make: *** [cmTC_a0a89/fast] Error 2

CMake will not be able to correctly generate this project.
Call Stack (most recent call first):
CMakeLists.txt:4 (project)

— Configuring incomplete, errors occurred!
See also «/home/cybrosys/project/eos/eos/build/CMakeFiles/CMakeOutput.log».
See also «/home/cybrosys/project/eos/eos/build/CMakeFiles/CMakeError.log».

>>>>>>>>>>>>>>>>>>>> CMAKE building EOSIO has exited with the above error.

Добавить комментарий