[bitcoin/bitcoin] OpenBSD 6.3 build: test/arith_uint256_tests.cpp complains about missing argument (#13337)

I’m able to reproduce this issue under stock OpenBSD 6.3 using the default shell:

«`
$ uname -r
6.3
$ echo $0
-ksh
$ gmake check
Making check in src
gmake[1]: Entering directory ‘/…/bitcoin/src’
gmake[2]: Entering directory ‘/…/bitcoin/src’
gmake[3]: Entering directory ‘/…/bitcoin’
gmake[3]: Leaving directory ‘/…/bitcoin’
gmake check-TESTS check-local
gmake[3]: Entering directory ‘/…/bitcoin/src’
gmake[4]: Entering directory ‘/…/bitcoin/src’
============================================================================
Testsuite summary for Bitcoin Core 0.16.99
============================================================================
# TOTAL: 0
# PASS: 0
# SKIP: 0
# XFAIL: 0
# FAIL: 0
# XPASS: 0
# ERROR: 0
============================================================================
gmake[4]: Leaving directory ‘/…/bitcoin/src’
Running tests: from test/arith_uint256_tests.cpp
Missing an argument value for the parameter run_test in the argument

Parameter: run_test
Filters, which test units to include or exclude from test module execution.
Command line formats:
—run_test=
-t
Environment variable: BOOST_TEST_RUN_FILTERS

For detailed help on Boost.Test parameters use:
test_bitcoin —help
or
test_bitcoin —help= gmake[3]: *** [Makefile:10247: test/arith_uint256_tests.cpp.test] Error 1
gmake[3]: Leaving directory ‘/…/bitcoin/src’
gmake[2]: *** [Makefile:9996: check-am] Error 2
gmake[2]: Leaving directory ‘/…/bitcoin/src’
gmake[1]: *** [Makefile:9684: check-recursive] Error 1
gmake[1]: Leaving directory ‘/…/bitcoin/src’
gmake: *** [Makefile:754: check-recursive] Error 1
«`

Запись редактировалась последний раз: May 31, 2018, 9:56 am